{"text_format":"1","workbook":"xlsx","n_sheets":6,"sheets":["Liste_list","Warteliste_waiting list","Nicht Teilgenommen_no show","Tabelle1","Hilfstabelle","Etiketten_labels"],"not_rendered":{"charts":0,"images":1,"macros":1,"external_links":0,"defined_names":20,"comments":1,"pivot_tables":0},"unopened":[],"bounds":{"document_bytes":16777216,"sheet_cells":100000,"rows_first":2000,"rows_last":500,"rows_between":2000,"halvings":0,"cell_chars":16384,"cell_head_chars":4096},"cells_cut":0,"cells_raw":0,"read":"whole","date_system":"1900"}

{"sheet":"Liste_list","index":0,"n_rows":105,"n_cols":17,"rows_kept":105,"cut":false,"hidden":false,"merged":[[13,0,14,0],[13,2,13,3],[13,9,14,9],[13,10,14,10],[7,5,7,6],[8,5,8,6],[9,5,9,6],[10,5,10,6],[13,1,14,1],[13,16,14,16],[3,3,3,6],[4,3,4,6],[5,3,5,6],[11,3,11,6],[13,11,13,15],[3,12,3,14],[13,4,13,8]]}
[null,null,"Teilnehmer- und Bewertungsliste / List of participants and results             "]
[null,null,"Diese Liste ist nach Meldeschluss (Anmeldungen) und nach Veranstaltungsende (Ergebnisse) an die IRO zu senden. "]
[null,null,"Please send this list after the registration deadline (registrations) and after the end of the event (results) to the IRO. "]
[null,null,"NRO"]
[null,null,"Prüfungsort\nTest Location:"]
[null,null,"Datum\nDate"]
[]
[null,null,null,"A/B","Sparte, Stufe\nDiscipline, Level","Richtername\nName of Judge"]
[null,null,"LR / Judge  1 :"]
[null,null,"LR / Judge  2 :"]
[null,null,"LR / Judge  3 :"]
[null,null,"Prüfungsleiter /\nTest Organising Officer"]
[]
["Nr.        No.","Anmeldedatum, -zeit\nRegistration date and time","Hundeführer/in Dog Handler",null,"Hund / Dog",null,null,null,null,"NRO","Land           Country","Ergebnisse / Results",null,null,null,null,"Bemerkungen  Remarks"]
[null,null,"Name \nSurname","Vorname                                  \nFirst Name","Hundename                               \nDog Name","Rasse\nBreed","Wurfdatum              \nLitter Date","Chip/Tattoo Nr.            Chip/Tattoo No.","Rüde/ Hündin                  male/ female",null,null,"Sparte","A","B","Gesamtpunkte   Total Points","Note    Grade"]
[1]
[2]
[3]
[4]
[5]
[6]
[7]
[8]
[9]
[10]
[11]
[12]
[13]
[14]
[15]
[16]
[17]
[18]
[19]
[20]
[21]
[22]
[23]
[24]
[25]
{"$rows_left_out":66}
{"sheet":"Warteliste_waiting list","index":1,"n_rows":25,"n_cols":10,"rows_kept":25,"cut":false,"hidden":false,"merged":[[0,0,0,9],[2,0,3,0],[2,2,2,3],[2,4,2,7],[2,8,3,8],[2,9,3,9],[2,1,3,1]]}
["Liste der gemeldeten Teams auf der Warteliste (max. 5 pro Disziplin & Stufe) / List of teams on waiting list (max. 5 per discpline & level)"]
[]
["Nr.        No.","Anmeldedatum, -zeit\nRegistration date and time","Hundeführer/in Dog Handler",null,"Hund / Dog",null,null,null,"NRO","Land           Country"]
[null,null,"Name                      Surname","Vorname                                   Firstname","Hundename                                Dogname","Rasse              Breed","Wurfdatum              Litter Date","Chip/Tattoo Nr.            Chip/Tattoo No."]
[1]
[2]
[3]
[4]
[5]
[6]
[7]
[8]
[9]
[10]
[11]
[12]
[13]
[14]
[15]
[16]
[17]
[18]
[19]
[20]
[21]

{"sheet":"Nicht Teilgenommen_no show","index":2,"n_rows":25,"n_cols":18,"rows_kept":25,"cut":false,"hidden":false,"merged":[[0,0,0,17],[2,17,3,17],[2,0,3,0],[2,1,2,2],[2,3,2,6],[2,8,3,8],[2,9,3,9]]}
["Liste der gemeldeten aber nicht teilgenommenen Teams / List of registered teams which did not show"]
[]
["Nr.        No.","Hundeführer/in Dog Handler",null,"Hund / Dog",null,null,null,null,"NRO","Land           Country",null,null,null,null,null,null,null,"Grund der Nichtteilnahme            Reason for no-show"]
[null,"Name                      Surname","Vorname                                   Firstname","Hundename                                Dogname","Rasse              Breed","Wurfdatum              Litter Date","Chip/Tattoo Nr.            Chip/Tattoo No.","Sparte / Discipline"]
[1]
[2]
[3]
[4]
[5]
[6]
[7]
[8]
[9]
[10]
[11]
[12]
[13]
[14]
[15]
[16]
[17]
[18]
[19]
[20]
[21]

{"sheet":"Tabelle1","index":3,"n_rows":3,"n_cols":1,"rows_kept":3,"cut":false,"hidden":true,"merged":[]}
[]
["Nasenarbeit/Scent Work"]
["Unterordnung und Gewandtheit/Obedience and Dexterity"]

{"sheet":"Hilfstabelle","index":4,"n_rows":20,"n_cols":3,"rows_kept":20,"cut":false,"hidden":false,"merged":[]}
["Prüfungssparten","Noten","Prüfungssparten neu"]
["RH-F E","v"]
["RH-F A","sg","T-V"]
["RH-F B","g","T-A"]
["RH-FL E","b","T-B"]
["RH-FL A","m","FL-V"]
["RH-FL B","abg.","FL-A"]
["RH-T E","dis.","FL-B"]
["RH-T A","no show","F-V"]
["RH-T B",null,"F-A"]
["RH-L E",null,"F-B"]
["RH-L A",null,"MT-V"]
["RH-L B",null,"MT-A"]
["RH-W E",null,"MT-B"]
["RH-W A",null,"W-V"]
["RH-W B",null,"W-A"]
[null,null,"W-B"]
[null,null,"L-V"]
[null,null,"L-A"]
[null,null,"L-B"]

{"sheet":"Etiketten_labels","index":5,"n_rows":90,"n_cols":6,"rows_kept":90,"cut":false,"hidden":false,"merged":[]}
["Name","Vorname","Hundename","Wurfdatum","ChipTattoo_Nr","Rüde/ Hündin          "]
[{"$f":"IF(Liste_list!C16<>\"\",Liste_list!C16,\"\")","v":""},{"$f":"IF(Liste_list!D16<>\"\",Liste_list!D16,\"\")","v":""},{"$f":"IF(Liste_list!E16<>\"\",Liste_list!E16,\"\")","v":""},{"$f":"IF(Liste_list!G16<>\"\",Liste_list!G16,\"\")","v":""},{"$f":"IF(Liste_list!H16<>\"\",Liste_list!H16,\"\")","v":""},{"$f":"IF(Liste_list!I16<>\"\",Liste_list!I16,\"\")","v":""}]
[{"$f":"IF(Liste_list!C17<>\"\",Liste_list!C17,\"\")","v":""},{"$f":"IF(Liste_list!D17<>\"\",Liste_list!D17,\"\")","v":""},{"$f":"IF(Liste_list!E17<>\"\",Liste_list!E17,\"\")","v":""},{"$f":"IF(Liste_list!G17<>\"\",Liste_list!G17,\"\")","v":""},{"$f":"IF(Liste_list!H17<>\"\",Liste_list!H17,\"\")","v":""},{"$f":"IF(Liste_list!I17<>\"\",Liste_list!I17,\"\")","v":""}]
[{"$f":"IF(Liste_list!C18<>\"\",Liste_list!C18,\"\")","v":""},{"$f":"IF(Liste_list!D18<>\"\",Liste_list!D18,\"\")","v":""},{"$f":"IF(Liste_list!E18<>\"\",Liste_list!E18,\"\")","v":""},{"$f":"IF(Liste_list!G18<>\"\",Liste_list!G18,\"\")","v":""},{"$f":"IF(Liste_list!H18<>\"\",Liste_list!H18,\"\")","v":""},{"$f":"IF(Liste_list!I18<>\"\",Liste_list!I18,\"\")","v":""}]
[{"$f":"IF(Liste_list!C19<>\"\",Liste_list!C19,\"\")","v":""},{"$f":"IF(Liste_list!D19<>\"\",Liste_list!D19,\"\")","v":""},{"$f":"IF(Liste_list!E19<>\"\",Liste_list!E19,\"\")","v":""},{"$f":"IF(Liste_list!G19<>\"\",Liste_list!G19,\"\")","v":""},{"$f":"IF(Liste_list!H19<>\"\",Liste_list!H19,\"\")","v":""},{"$f":"IF(Liste_list!I19<>\"\",Liste_list!I19,\"\")","v":""}]
[{"$f":"IF(Liste_list!C20<>\"\",Liste_list!C20,\"\")","v":""},{"$f":"IF(Liste_list!D20<>\"\",Liste_list!D20,\"\")","v":""},{"$f":"IF(Liste_list!E20<>\"\",Liste_list!E20,\"\")","v":""},{"$f":"IF(Liste_list!G20<>\"\",Liste_list!G20,\"\")","v":""},{"$f":"IF(Liste_list!H20<>\"\",Liste_list!H20,\"\")","v":""},{"$f":"IF(Liste_list!I20<>\"\",Liste_list!I20,\"\")","v":""}]
[{"$f":"IF(Liste_list!C21<>\"\",Liste_list!C21,\"\")","v":""},{"$f":"IF(Liste_list!D21<>\"\",Liste_list!D21,\"\")","v":""},{"$f":"IF(Liste_list!E21<>\"\",Liste_list!E21,\"\")","v":""},{"$f":"IF(Liste_list!G21<>\"\",Liste_list!G21,\"\")","v":""},{"$f":"IF(Liste_list!H21<>\"\",Liste_list!H21,\"\")","v":""},{"$f":"IF(Liste_list!I21<>\"\",Liste_list!I21,\"\")","v":""}]
[{"$f":"IF(Liste_list!C22<>\"\",Liste_list!C22,\"\")","v":""},{"$f":"IF(Liste_list!D22<>\"\",Liste_list!D22,\"\")","v":""},{"$f":"IF(Liste_list!E22<>\"\",Liste_list!E22,\"\")","v":""},{"$f":"IF(Liste_list!G22<>\"\",Liste_list!G22,\"\")","v":""},{"$f":"IF(Liste_list!H22<>\"\",Liste_list!H22,\"\")","v":""},{"$f":"IF(Liste_list!I22<>\"\",Liste_list!I22,\"\")","v":""}]
[{"$f":"IF(Liste_list!C23<>\"\",Liste_list!C23,\"\")","v":""},{"$f":"IF(Liste_list!D23<>\"\",Liste_list!D23,\"\")","v":""},{"$f":"IF(Liste_list!E23<>\"\",Liste_list!E23,\"\")","v":""},{"$f":"IF(Liste_list!G23<>\"\",Liste_list!G23,\"\")","v":""},{"$f":"IF(Liste_list!H23<>\"\",Liste_list!H23,\"\")","v":""},{"$f":"IF(Liste_list!I23<>\"\",Liste_list!I23,\"\")","v":""}]
[{"$f":"IF(Liste_list!C24<>\"\",Liste_list!C24,\"\")","v":""},{"$f":"IF(Liste_list!D24<>\"\",Liste_list!D24,\"\")","v":""},{"$f":"IF(Liste_list!E24<>\"\",Liste_list!E24,\"\")","v":""},{"$f":"IF(Liste_list!G24<>\"\",Liste_list!G24,\"\")","v":""},{"$f":"IF(Liste_list!H24<>\"\",Liste_list!H24,\"\")","v":""},{"$f":"IF(Liste_list!I24<>\"\",Liste_list!I24,\"\")","v":""}]
[{"$f":"IF(Liste_list!C25<>\"\",Liste_list!C25,\"\")","v":""},{"$f":"IF(Liste_list!D25<>\"\",Liste_list!D25,\"\")","v":""},{"$f":"IF(Liste_list!E25<>\"\",Liste_list!E25,\"\")","v":""},{"$f":"IF(Liste_list!G25<>\"\",Liste_list!G25,\"\")","v":""},{"$f":"IF(Liste_list!H25<>\"\",Liste_list!H25,\"\")","v":""},{"$f":"IF(Liste_list!I25<>\"\",Liste_list!I25,\"\")","v":""}]
[{"$f":"IF(Liste_list!C26<>\"\",Liste_list!C26,\"\")","v":""},{"$f":"IF(Liste_list!D26<>\"\",Liste_list!D26,\"\")","v":""},{"$f":"IF(Liste_list!E26<>\"\",Liste_list!E26,\"\")","v":""},{"$f":"IF(Liste_list!G26<>\"\",Liste_list!G26,\"\")","v":""},{"$f":"IF(Liste_list!H26<>\"\",Liste_list!H26,\"\")","v":""},{"$f":"IF(Liste_list!I26<>\"\",Liste_list!I26,\"\")","v":""}]
[{"$f":"IF(Liste_list!C27<>\"\",Liste_list!C27,\"\")","v":""},{"$f":"IF(Liste_list!D27<>\"\",Liste_list!D27,\"\")","v":""},{"$f":"IF(Liste_list!E27<>\"\",Liste_list!E27,\"\")","v":""},{"$f":"IF(Liste_list!G27<>\"\",Liste_list!G27,\"\")","v":""},{"$f":"IF(Liste_list!H27<>\"\",Liste_list!H27,\"\")","v":""},{"$f":"IF(Liste_list!I27<>\"\",Liste_list!I27,\"\")","v":""}]
[{"$f":"IF(Liste_list!C28<>\"\",Liste_list!C28,\"\")","v":""},{"$f":"IF(Liste_list!D28<>\"\",Liste_list!D28,\"\")","v":""},{"$f":"IF(Liste_list!E28<>\"\",Liste_list!E28,\"\")","v":""},{"$f":"IF(Liste_list!G28<>\"\",Liste_list!G28,\"\")","v":""},{"$f":"IF(Liste_list!H28<>\"\",Liste_list!H28,\"\")","v":""},{"$f":"IF(Liste_list!I28<>\"\",Liste_list!I28,\"\")","v":""}]
[{"$f":"IF(Liste_list!C29<>\"\",Liste_list!C29,\"\")","v":""},{"$f":"IF(Liste_list!D29<>\"\",Liste_list!D29,\"\")","v":""},{"$f":"IF(Liste_list!E29<>\"\",Liste_list!E29,\"\")","v":""},{"$f":"IF(Liste_list!G29<>\"\",Liste_list!G29,\"\")","v":""},{"$f":"IF(Liste_list!H29<>\"\",Liste_list!H29,\"\")","v":""},{"$f":"IF(Liste_list!I29<>\"\",Liste_list!I29,\"\")","v":""}]
[{"$f":"IF(Liste_list!C30<>\"\",Liste_list!C30,\"\")","v":""},{"$f":"IF(Liste_list!D30<>\"\",Liste_list!D30,\"\")","v":""},{"$f":"IF(Liste_list!E30<>\"\",Liste_list!E30,\"\")","v":""},{"$f":"IF(Liste_list!G30<>\"\",Liste_list!G30,\"\")","v":""},{"$f":"IF(Liste_list!H30<>\"\",Liste_list!H30,\"\")","v":""},{"$f":"IF(Liste_list!I30<>\"\",Liste_list!I30,\"\")","v":""}]
[{"$f":"IF(Liste_list!C31<>\"\",Liste_list!C31,\"\")","v":""},{"$f":"IF(Liste_list!D31<>\"\",Liste_list!D31,\"\")","v":""},{"$f":"IF(Liste_list!E31<>\"\",Liste_list!E31,\"\")","v":""},{"$f":"IF(Liste_list!G31<>\"\",Liste_list!G31,\"\")","v":""},{"$f":"IF(Liste_list!H31<>\"\",Liste_list!H31,\"\")","v":""},{"$f":"IF(Liste_list!I31<>\"\",Liste_list!I31,\"\")","v":""}]
[{"$f":"IF(Liste_list!C32<>\"\",Liste_list!C32,\"\")","v":""},{"$f":"IF(Liste_list!D32<>\"\",Liste_list!D32,\"\")","v":""},{"$f":"IF(Liste_list!E32<>\"\",Liste_list!E32,\"\")","v":""},{"$f":"IF(Liste_list!G32<>\"\",Liste_list!G32,\"\")","v":""},{"$f":"IF(Liste_list!H32<>\"\",Liste_list!H32,\"\")","v":""},{"$f":"IF(Liste_list!I32<>\"\",Liste_list!I32,\"\")","v":""}]
[{"$f":"IF(Liste_list!C33<>\"\",Liste_list!C33,\"\")","v":""},{"$f":"IF(Liste_list!D33<>\"\",Liste_list!D33,\"\")","v":""},{"$f":"IF(Liste_list!E33<>\"\",Liste_list!E33,\"\")","v":""},{"$f":"IF(Liste_list!G33<>\"\",Liste_list!G33,\"\")","v":""},{"$f":"IF(Liste_list!H33<>\"\",Liste_list!H33,\"\")","v":""},{"$f":"IF(Liste_list!I33<>\"\",Liste_list!I33,\"\")","v":""}]
[{"$f":"IF(Liste_list!C34<>\"\",Liste_list!C34,\"\")","v":""},{"$f":"IF(Liste_list!D34<>\"\",Liste_list!D34,\"\")","v":""},{"$f":"IF(Liste_list!E34<>\"\",Liste_list!E34,\"\")","v":""},{"$f":"IF(Liste_list!G34<>\"\",Liste_list!G34,\"\")","v":""},{"$f":"IF(Liste_list!H34<>\"\",Liste_list!H34,\"\")","v":""},{"$f":"IF(Liste_list!I34<>\"\",Liste_list!I34,\"\")","v":""}]
[{"$f":"IF(Liste_list!C35<>\"\",Liste_list!C35,\"\")","v":""},{"$f":"IF(Liste_list!D35<>\"\",Liste_list!D35,\"\")","v":""},{"$f":"IF(Liste_list!E35<>\"\",Liste_list!E35,\"\")","v":""},{"$f":"IF(Liste_list!G35<>\"\",Liste_list!G35,\"\")","v":""},{"$f":"IF(Liste_list!H35<>\"\",Liste_list!H35,\"\")","v":""},{"$f":"IF(Liste_list!I35<>\"\",Liste_list!I35,\"\")","v":""}]
[{"$f":"IF(Liste_list!C36<>\"\",Liste_list!C36,\"\")","v":""},{"$f":"IF(Liste_list!D36<>\"\",Liste_list!D36,\"\")","v":""},{"$f":"IF(Liste_list!E36<>\"\",Liste_list!E36,\"\")","v":""},{"$f":"IF(Liste_list!G36<>\"\",Liste_list!G36,\"\")","v":""},{"$f":"IF(Liste_list!H36<>\"\",Liste_list!H36,\"\")","v":""},{"$f":"IF(Liste_list!I36<>\"\",Liste_list!I36,\"\")","v":""}]
[{"$f":"IF(Liste_list!C37<>\"\",Liste_list!C37,\"\")","v":""},{"$f":"IF(Liste_list!D37<>\"\",Liste_list!D37,\"\")","v":""},{"$f":"IF(Liste_list!E37<>\"\",Liste_list!E37,\"\")","v":""},{"$f":"IF(Liste_list!G37<>\"\",Liste_list!G37,\"\")","v":""},{"$f":"IF(Liste_list!H37<>\"\",Liste_list!H37,\"\")","v":""},{"$f":"IF(Liste_list!I37<>\"\",Liste_list!I37,\"\")","v":""}]
[{"$f":"IF(Liste_list!C38<>\"\",Liste_list!C38,\"\")","v":""},{"$f":"IF(Liste_list!D38<>\"\",Liste_list!D38,\"\")","v":""},{"$f":"IF(Liste_list!E38<>\"\",Liste_list!E38,\"\")","v":""},{"$f":"IF(Liste_list!G38<>\"\",Liste_list!G38,\"\")","v":""},{"$f":"IF(Liste_list!H38<>\"\",Liste_list!H38,\"\")","v":""},{"$f":"IF(Liste_list!I38<>\"\",Liste_list!I38,\"\")","v":""}]
[{"$f":"IF(Liste_list!C39<>\"\",Liste_list!C39,\"\")","v":""},{"$f":"IF(Liste_list!D39<>\"\",Liste_list!D39,\"\")","v":""},{"$f":"IF(Liste_list!E39<>\"\",Liste_list!E39,\"\")","v":""},{"$f":"IF(Liste_list!G39<>\"\",Liste_list!G39,\"\")","v":""},{"$f":"IF(Liste_list!H39<>\"\",Liste_list!H39,\"\")","v":""},{"$f":"IF(Liste_list!I39<>\"\",Liste_list!I39,\"\")","v":""}]
[{"$f":"IF(Liste_list!C40<>\"\",Liste_list!C40,\"\")","v":""},{"$f":"IF(Liste_list!D40<>\"\",Liste_list!D40,\"\")","v":""},{"$f":"IF(Liste_list!E40<>\"\",Liste_list!E40,\"\")","v":""},{"$f":"IF(Liste_list!G40<>\"\",Liste_list!G40,\"\")","v":""},{"$f":"IF(Liste_list!H40<>\"\",Liste_list!H40,\"\")","v":""},{"$f":"IF(Liste_list!I40<>\"\",Liste_list!I40,\"\")","v":""}]
[{"$f":"IF(Liste_list!C41<>\"\",Liste_list!C41,\"\")","v":""},{"$f":"IF(Liste_list!D41<>\"\",Liste_list!D41,\"\")","v":""},{"$f":"IF(Liste_list!E41<>\"\",Liste_list!E41,\"\")","v":""},{"$f":"IF(Liste_list!G41<>\"\",Liste_list!G41,\"\")","v":""},{"$f":"IF(Liste_list!H41<>\"\",Liste_list!H41,\"\")","v":""},{"$f":"IF(Liste_list!I41<>\"\",Liste_list!I41,\"\")","v":""}]
[{"$f":"IF(Liste_list!C42<>\"\",Liste_list!C42,\"\")","v":""},{"$f":"IF(Liste_list!D42<>\"\",Liste_list!D42,\"\")","v":""},{"$f":"IF(Liste_list!E42<>\"\",Liste_list!E42,\"\")","v":""},{"$f":"IF(Liste_list!G42<>\"\",Liste_list!G42,\"\")","v":""},{"$f":"IF(Liste_list!H42<>\"\",Liste_list!H42,\"\")","v":""},{"$f":"IF(Liste_list!I42<>\"\",Liste_list!I42,\"\")","v":""}]
[{"$f":"IF(Liste_list!C43<>\"\",Liste_list!C43,\"\")","v":""},{"$f":"IF(Liste_list!D43<>\"\",Liste_list!D43,\"\")","v":""},{"$f":"IF(Liste_list!E43<>\"\",Liste_list!E43,\"\")","v":""},{"$f":"IF(Liste_list!G43<>\"\",Liste_list!G43,\"\")","v":""},{"$f":"IF(Liste_list!H43<>\"\",Liste_list!H43,\"\")","v":""},{"$f":"IF(Liste_list!I43<>\"\",Liste_list!I43,\"\")","v":""}]
[{"$f":"IF(Liste_list!C44<>\"\",Liste_list!C44,\"\")","v":""},{"$f":"IF(Liste_list!D44<>\"\",Liste_list!D44,\"\")","v":""},{"$f":"IF(Liste_list!E44<>\"\",Liste_list!E44,\"\")","v":""},{"$f":"IF(Liste_list!G44<>\"\",Liste_list!G44,\"\")","v":""},{"$f":"IF(Liste_list!H44<>\"\",Liste_list!H44,\"\")","v":""},{"$f":"IF(Liste_list!I44<>\"\",Liste_list!I44,\"\")","v":""}]
[{"$f":"IF(Liste_list!C45<>\"\",Liste_list!C45,\"\")","v":""},{"$f":"IF(Liste_list!D45<>\"\",Liste_list!D45,\"\")","v":""},{"$f":"IF(Liste_list!E45<>\"\",Liste_list!E45,\"\")","v":""},{"$f":"IF(Liste_list!G45<>\"\",Liste_list!G45,\"\")","v":""},{"$f":"IF(Liste_list!H45<>\"\",Liste_list!H45,\"\")","v":""},{"$f":"IF(Liste_list!I45<>\"\",Liste_list!I45,\"\")","v":""}]
[{"$f":"IF(Liste_list!C46<>\"\",Liste_list!C46,\"\")","v":""},{"$f":"IF(Liste_list!D46<>\"\",Liste_list!D46,\"\")","v":""},{"$f":"IF(Liste_list!E46<>\"\",Liste_list!E46,\"\")","v":""},{"$f":"IF(Liste_list!G46<>\"\",Liste_list!G46,\"\")","v":""},{"$f":"IF(Liste_list!H46<>\"\",Liste_list!H46,\"\")","v":""},{"$f":"IF(Liste_list!I46<>\"\",Liste_list!I46,\"\")","v":""}]
[{"$f":"IF(Liste_list!C47<>\"\",Liste_list!C47,\"\")","v":""},{"$f":"IF(Liste_list!D47<>\"\",Liste_list!D47,\"\")","v":""},{"$f":"IF(Liste_list!E47<>\"\",Liste_list!E47,\"\")","v":""},{"$f":"IF(Liste_list!G47<>\"\",Liste_list!G47,\"\")","v":""},{"$f":"IF(Liste_list!H47<>\"\",Liste_list!H47,\"\")","v":""},{"$f":"IF(Liste_list!I47<>\"\",Liste_list!I47,\"\")","v":""}]
[{"$f":"IF(Liste_list!C48<>\"\",Liste_list!C48,\"\")","v":""},{"$f":"IF(Liste_list!D48<>\"\",Liste_list!D48,\"\")","v":""},{"$f":"IF(Liste_list!E48<>\"\",Liste_list!E48,\"\")","v":""},{"$f":"IF(Liste_list!G48<>\"\",Liste_list!G48,\"\")","v":""},{"$f":"IF(Liste_list!H48<>\"\",Liste_list!H48,\"\")","v":""},{"$f":"IF(Liste_list!I48<>\"\",Liste_list!I48,\"\")","v":""}]
[{"$f":"IF(Liste_list!C49<>\"\",Liste_list!C49,\"\")","v":""},{"$f":"IF(Liste_list!D49<>\"\",Liste_list!D49,\"\")","v":""},{"$f":"IF(Liste_list!E49<>\"\",Liste_list!E49,\"\")","v":""},{"$f":"IF(Liste_list!G49<>\"\",Liste_list!G49,\"\")","v":""},{"$f":"IF(Liste_list!H49<>\"\",Liste_list!H49,\"\")","v":""},{"$f":"IF(Liste_list!I49<>\"\",Liste_list!I49,\"\")","v":""}]
[{"$f":"IF(Liste_list!C50<>\"\",Liste_list!C50,\"\")","v":""},{"$f":"IF(Liste_list!D50<>\"\",Liste_list!D50,\"\")","v":""},{"$f":"IF(Liste_list!E50<>\"\",Liste_list!E50,\"\")","v":""},{"$f":"IF(Liste_list!G50<>\"\",Liste_list!G50,\"\")","v":""},{"$f":"IF(Liste_list!H50<>\"\",Liste_list!H50,\"\")","v":""},{"$f":"IF(Liste_list!I50<>\"\",Liste_list!I50,\"\")","v":""}]
[{"$f":"IF(Liste_list!C51<>\"\",Liste_list!C51,\"\")","v":""},{"$f":"IF(Liste_list!D51<>\"\",Liste_list!D51,\"\")","v":""},{"$f":"IF(Liste_list!E51<>\"\",Liste_list!E51,\"\")","v":""},{"$f":"IF(Liste_list!G51<>\"\",Liste_list!G51,\"\")","v":""},{"$f":"IF(Liste_list!H51<>\"\",Liste_list!H51,\"\")","v":""},{"$f":"IF(Liste_list!I51<>\"\",Liste_list!I51,\"\")","v":""}]
[{"$f":"IF(Liste_list!C52<>\"\",Liste_list!C52,\"\")","v":""},{"$f":"IF(Liste_list!D52<>\"\",Liste_list!D52,\"\")","v":""},{"$f":"IF(Liste_list!E52<>\"\",Liste_list!E52,\"\")","v":""},{"$f":"IF(Liste_list!G52<>\"\",Liste_list!G52,\"\")","v":""},{"$f":"IF(Liste_list!H52<>\"\",Liste_list!H52,\"\")","v":""},{"$f":"IF(Liste_list!I52<>\"\",Liste_list!I52,\"\")","v":""}]
[{"$f":"IF(Liste_list!C53<>\"\",Liste_list!C53,\"\")","v":""},{"$f":"IF(Liste_list!D53<>\"\",Liste_list!D53,\"\")","v":""},{"$f":"IF(Liste_list!E53<>\"\",Liste_list!E53,\"\")","v":""},{"$f":"IF(Liste_list!G53<>\"\",Liste_list!G53,\"\")","v":""},{"$f":"IF(Liste_list!H53<>\"\",Liste_list!H53,\"\")","v":""},{"$f":"IF(Liste_list!I53<>\"\",Liste_list!I53,\"\")","v":""}]
[{"$f":"IF(Liste_list!C54<>\"\",Liste_list!C54,\"\")","v":""},{"$f":"IF(Liste_list!D54<>\"\",Liste_list!D54,\"\")","v":""},{"$f":"IF(Liste_list!E54<>\"\",Liste_list!E54,\"\")","v":""},{"$f":"IF(Liste_list!G54<>\"\",Liste_list!G54,\"\")","v":""},{"$f":"IF(Liste_list!H54<>\"\",Liste_list!H54,\"\")","v":""},{"$f":"IF(Liste_list!I54<>\"\",Liste_list!I54,\"\")","v":""}]
{"$rows_left_out":50}